Merge branch 'master' of dbgit.prakinf.tu-ilmenau.de:code/pfabric

3 jobs for master in 2 minutes and 35 seconds (queued for 3 seconds)
Status Name Job ID Coverage
  Build
failed build #2500
grouprunner

00:02:35

failed coverage #2501
grouprunner

00:00:20

 
  Test
skipped test #2502
grouprunner
 
Name Stage Failure
failed
coverage Build
    Complete output from command python setup.py egg_info:
Building lxml version 4.6.2.
Building without Cython.
Error: Please make sure the libxml2 and libxslt development packages are installed.

----------------------------------------
Command "python setup.py egg_info" failed with error code 1 in /tmp/pip-install-PeznAD/lxml/
Authenticating with credentials from /root/.docker/config.json
ERROR: Job failed: exit code 1
failed
build Build
                ^~~~
/builds/code/pfabric/src/table/BOCCTable.hpp:251:5: error: 'transaction' has not been declared
transaction::run(pop, [&]{
^~~~~~~~~~~
make[2]: *** [CMakeFiles/pfabric_core.dir/build.make:193: CMakeFiles/pfabric_core.dir/src/dsl/PFabricContext.cpp.o] Error 1
make[1]: *** [CMakeFiles/Makefile2:905: CMakeFiles/pfabric_core.dir/all] Error 2
make: *** [Makefile:141: all] Error 2
Authenticating with credentials from /root/.docker/config.json
ERROR: Job failed: exit code 1