Added more output to Tx examples for evaluation purposes

3 jobs for master in 9 minutes and 37 seconds (queued for 3 seconds)
Status Name Job ID Coverage
  Build
failed build #2945
grouprunner

00:03:55

failed coverage #2946
grouprunner

00:09:36

 
  Test
skipped test #2947
grouprunner
 
Name Stage Failure
failed
coverage Build
/builds/code/pfabric/src/table/StateContext.hpp:316:5: note: (if you use '-fpermissive', G++ will accept your code, but allowing the use of an undeclared name is deprecated)
/builds/code/pfabric/src/table/StateContext.hpp:318:5: error: there are no arguments to 'pmem_persist' that depend on a template parameter, so a declaration of 'pmem_persist' must be available [-fpermissive]
318 | pmem_persist(numGroups, sizeof(GroupID));
| ^~~~~~~~~~~~
make[2]: *** [CMakeFiles/pfabric_core.dir/build.make:212: CMakeFiles/pfabric_core.dir/src/dsl/PFabricContext.cpp.o] Error 1
make[1]: *** [CMakeFiles/Makefile2:1036: CMakeFiles/pfabric_core.dir/all] Error 2
make: *** [Makefile:160: all] Error 2
Authenticating with credentials from /root/.docker/config.json
ERROR: Job failed: exit code 1
failed
build Build
/builds/code/pfabric/src/table/StateContext.hpp:316:5: note: (if you use '-fpermissive', G++ will accept your code, but allowing the use of an undeclared name is deprecated)
/builds/code/pfabric/src/table/StateContext.hpp:318:5: error: there are no arguments to 'pmem_persist' that depend on a template parameter, so a declaration of 'pmem_persist' must be available [-fpermissive]
318 | pmem_persist(numGroups, sizeof(GroupID));
| ^~~~~~~~~~~~
make[2]: *** [CMakeFiles/pfabric_core.dir/build.make:212: CMakeFiles/pfabric_core.dir/src/dsl/PFabricContext.cpp.o] Error 1
make[1]: *** [CMakeFiles/Makefile2:1036: CMakeFiles/pfabric_core.dir/all] Error 2
make: *** [Makefile:160: all] Error 2
Authenticating with credentials from /root/.docker/config.json
ERROR: Job failed: exit code 1