Get rid of constructor order warning

3 jobs for master in 2 minutes and 8 seconds (queued for 3 seconds)
Status Job ID Name Coverage
  Build
failed build #2521
grouprunner

00:02:08

failed coverage #2522
grouprunner

00:02:02

 
  Test
skipped test #2523
grouprunner
 
Name Stage Failure
failed
coverage Build
make[1]: *** [CMakeFiles/Makefile2:483: test/CMakeFiles/PTableTest.dir/all] Error 2
make[1]: *** Waiting for unfinished jobs....
[ 66%] Linking CXX executable PTupleTest
[ 66%] Built target PTupleTest
[ 67%] Linking CXX executable wHBPTreeTest
[ 67%] Built target wHBPTreeTest
make: *** [Makefile:160: all] Error 2
Authenticating with credentials from /root/.docker/config.json
ERROR: Job failed: exit code 1
failed
build Build
make[1]: *** [CMakeFiles/Makefile2:483: test/CMakeFiles/PTableTest.dir/all] Error 2
make[1]: *** Waiting for unfinished jobs....
[ 66%] Linking CXX executable PTupleTest
[ 66%] Built target PTupleTest
[ 67%] Linking CXX executable wHBPTreeTest
[ 67%] Built target wHBPTreeTest
make: *** [Makefile:160: all] Error 2
Authenticating with credentials from /root/.docker/config.json
ERROR: Job failed: exit code 1