Merge branch 'master' of dbgit.prakinf.tu-ilmenau.de:code/nvm-based_data_structures

3 jobs for master in 5 minutes and 35 seconds (queued for 2 seconds)
Status Job ID Name Coverage
  Build
failed #1790
grouprunner
build

00:05:33

failed #1791
grouprunner
coverage

00:05:34

 
  Test
skipped #1792
grouprunner
test
 
Name Stage Failure
failed
coverage Build
make[1]: *** [CMakeFiles/Makefile2:465: test/CMakeFiles/FPTreeTest.dir/all] Error 2
make[1]: *** Waiting for unfinished jobs....
[ 32%] Linking CXX executable VTableInfoTest
[ 33%] Linking CXX executable BDCCInfoTest
[ 33%] Built target VTableInfoTest
[ 33%] Built target BDCCInfoTest
make: *** [Makefile:141: all] Error 2
Authenticating with credentials from /root/.docker/config.json
ERROR: Job failed: exit code 1
failed
build Build
make[1]: *** [CMakeFiles/Makefile2:465: test/CMakeFiles/FPTreeTest.dir/all] Error 2
make[1]: *** Waiting for unfinished jobs....
[ 32%] Linking CXX executable VTableInfoTest
[ 32%] Built target VTableInfoTest
[ 33%] Linking CXX executable BDCCInfoTest
[ 33%] Built target BDCCInfoTest
make: *** [Makefile:141: all] Error 2
Authenticating with credentials from /root/.docker/config.json
ERROR: Job failed: exit code 1