🔨 Started refactorization of trie and skip list code

3 jobs for master in 2 minutes and 14 seconds (queued for 2 seconds)
Status Job ID Name Coverage
  Build
failed #1765
grouprunner
build

00:02:14

failed #1766
grouprunner
coverage

00:01:49

 
  Test
skipped #1767
grouprunner
test
 
Name Stage Failure
failed
build Build
make[1]: *** [CMakeFiles/Makefile2:655: test/CMakeFiles/PatriciaTest.dir/all] Error 2
make[1]: *** Waiting for unfinished jobs....
[ 76%] Linking CXX executable PTableInfoTest
[ 76%] Built target PTableInfoTest
[ 77%] Linking CXX executable UnsortedPBPTreeTest
[ 77%] Built target UnsortedPBPTreeTest
make: *** [Makefile:141: all] Error 2
Authenticating with credentials from /root/.docker/config.json
ERROR: Job failed: exit code 1
failed
coverage Build
make[1]: *** [CMakeFiles/Makefile2:655: test/CMakeFiles/PatriciaTest.dir/all] Error 2
make[1]: *** Waiting for unfinished jobs....
[ 74%] Linking CXX executable PTableInfoTest
[ 74%] Built target PTableInfoTest
[ 75%] Linking CXX executable UnsortedPBPTreeTest
[ 75%] Built target UnsortedPBPTreeTest
make: *** [Makefile:141: all] Error 2
Authenticating with credentials from /root/.docker/config.json
ERROR: Job failed: exit code 1