Integrated PCM and small adjustments to benchmarks

3 jobs for master in 1 minute and 54 seconds (queued for 7 seconds)
Status Job ID Name Coverage
  Build
failed #1759
grouprunner
build

00:01:45

failed #1760
grouprunner
coverage

00:01:53

 
  Test
skipped #1761
grouprunner
test
 
Name Stage Failure
failed
coverage Build
make[1]: *** [CMakeFiles/Makefile2:1024: bench/CMakeFiles/tree_erase.dir/all] Error 2
make[1]: *** Waiting for unfinished jobs....
[ 54%] Linking CXX executable tree_balance
[ 54%] Built target tree_balance
[ 56%] Linking CXX executable point
[ 56%] Built target point
make: *** [Makefile:141: all] Error 2
Authenticating with credentials from /root/.docker/config.json
ERROR: Job failed: exit code 1
failed
build Build
make[1]: *** [CMakeFiles/Makefile2:1024: bench/CMakeFiles/tree_erase.dir/all] Error 2
make[1]: *** Waiting for unfinished jobs....
[ 52%] Linking CXX executable tree_traverse
[ 52%] Built target tree_traverse
[ 53%] Linking CXX executable tree_balance
[ 53%] Built target tree_balance
make: *** [Makefile:141: all] Error 2
Authenticating with credentials from /root/.docker/config.json
ERROR: Job failed: exit code 1