Add missing CMakeLists

3 jobs for more_data_structures in 2 minutes and 17 seconds (queued for 3 seconds)
Status Job ID Name Coverage
  Build
failed #1477
grouprunner
build

00:02:17

failed #1478
grouprunner
coverage

00:01:41

 
  Test
skipped #1479
grouprunner
test
 
Name Stage Failure
failed
build Build
make[1]: *** [CMakeFiles/Makefile2:569: test/CMakeFiles/woPSkiplistTest.dir/all] Error 2
make[1]: *** Waiting for unfinished jobs....
[ 76%] Linking CXX executable PTableInfoTest
[ 76%] Built target PTableInfoTest
[ 77%] Linking CXX executable PBPTreeTest
[ 77%] Built target PBPTreeTest
make: *** [Makefile:141: all] Error 2
Authenticating with credentials from /root/.docker/config.json
ERROR: Job failed: exit code 1
failed
coverage Build
make[2]: *** [test/CMakeFiles/woPSkiplistTest.dir/build.make:63: test/CMakeFiles/woPSkiplistTest.dir/woPSkiplistTest.cpp.o] Error 1
make[1]: *** [CMakeFiles/Makefile2:569: test/CMakeFiles/woPSkiplistTest.dir/all] Error 2
make[1]: *** Waiting for unfinished jobs....
[ 49%] Built target PBPTreeTest
[ 50%] Linking CXX executable PTableInfoTest
[ 50%] Built target PTableInfoTest
make: *** [Makefile:141: all] Error 2
Authenticating with credentials from /root/.docker/config.json
ERROR: Job failed: exit code 1