Fix includes

3 jobs for more_data_structures in 3 minutes and 27 seconds (queued for 1 second)
Status Job ID Name Coverage
  Build
failed #1054
grouprunner
build

00:02:02

failed #1055
grouprunner
coverage

00:01:24

 
  Test
skipped #1056
grouprunner
test
 
Name Stage Failure
failed
build Build
make[1]: *** [CMakeFiles/Makefile2:546: test/CMakeFiles/woPSkiplistTest.dir/all] Error 2
make[1]: *** Waiting for unfinished jobs....
[ 72%] Linking CXX executable BitHPBPTreeTest
[ 72%] Built target BitHPBPTreeTest
[ 73%] Linking CXX executable UnsortedPBPTreeTest
[ 73%] Built target UnsortedPBPTreeTest
make: *** [Makefile:141: all] Error 2
Authenticating with credentials from /root/.docker/config.json
ERROR: Job failed: exit code 1
failed
coverage Build
      |     ^
make[2]: *** [test/CMakeFiles/woPSkiplistTest.dir/build.make:63: test/CMakeFiles/woPSkiplistTest.dir/woPSkiplistTest.cpp.o] Error 1
make[1]: *** [CMakeFiles/Makefile2:546: test/CMakeFiles/woPSkiplistTest.dir/all] Error 2
make[1]: *** Waiting for unfinished jobs....
[ 46%] Built target UnsortedPBPTreeTest
[ 46%] Built target BitHPBPTreeTest
make: *** [Makefile:141: all] Error 2
Authenticating with credentials from /root/.docker/config.json
ERROR: Job failed: exit code 1